test (self-hosted, Windows, hfenduleam)	Test — Phase B (heavy class, serialized, on a now-quiet box)	﻿2026-07-29T08:52:34.9044876Z ##[group]Run cargo nextest run --workspace --no-fail-fast -E '(package(spt-daemon) & kind(test) & binary(/^(attach|brain_swap|broker|budget|conn_blackhole_lifecycle|controller_lease|daemon_e2e|daemon_lifecycle_real_brain|digest|dispatch|driven_by_selfheal|endpoint_lifecycle|endpoint_survival|handoff|idempotent|inject_control_wedge|input_ack_deadlock|mesh_recovery|net_worker_starve|redispatch|redispatch_stall|registry_lifecycle|render_lifecycle|resize_geometry_epoch|resize_presentation_barrier|restart_replay_lifetime|resume|shellchan|spawn_truth|transport_death_eof|two_origin_spanning|twohost)$/)) | (package(spt) & kind(tes…
test (self-hosted, Windows, hfenduleam)	Test — Phase B (heavy class, serialized, on a now-quiet box)	2026-07-29T08:52:34.9050549Z cargo nextest run --workspace --no-fail-fast -E '(package(spt-daemon) & kind(test) & binary(/^(attach|brain_swap|broker|budget|conn_blackhole_lifecycle|controller_lease|daemon_e2e|daemon_lifecycle_real_brain|digest|dispatch|driven_by_selfheal|endpoint_lifecycle|endpoint_survival|handoff|idempotent|inject_control_wedge|input_ack_deadlock|mesh_recovery|net_worker_starve|redispatch|redispatch_stall|registry_lifecycle|render_lifecycle|resize_geometry_epoch|resize_presentation_barrier|restart_replay_lifetime|resume|shellchan|spawn_truth|transport_death_eof|two_origin_spanning|twohost)$/)) | (package(spt) & kind(test) & binary(/^(a…
test (self-hosted, Windows, hfenduleam)	Test — Phase B (heavy class, serialized, on a now-quiet box)	2026-07-29T08:52:34.9056923Z shell: C:\Program Files\PowerShell\7\pwsh.EXE -command ". '{0}'"
test (self-hosted, Windows, hfenduleam)	Test — Phase B (heavy class, serialized, on a now-quiet box)	2026-07-29T08:52:34.9057145Z env:
test (self-hosted, Windows, hfenduleam)	Test — Phase B (heavy class, serialized, on a now-quiet box)	2026-07-29T08:52:34.9057264Z   SPT_ATTACH_GATE_WATCHDOG_MS: 120000
test (self-hosted, Windows, hfenduleam)	Test — Phase B (heavy class, serialized, on a now-quiet box)	2026-07-29T08:52:34.9057431Z   SPT_ATTACH_IPC_DEADLINE_MS: 30000
test (self-hosted, Windows, hfenduleam)	Test — Phase B (heavy class, serialized, on a now-quiet box)	2026-07-29T08:52:34.9057737Z   SPT_CI_TEST_TMP: C:\actions-runner\_work\_temp\spt-test-tmp-30436637478-1-1d3e265e394f4acbad7a056e2b56d080
test (self-hosted, Windows, hfenduleam)	Test — Phase B (heavy class, serialized, on a now-quiet box)	2026-07-29T08:52:34.9058155Z   TEMP: C:\actions-runner\_work\_temp\spt-test-tmp-30436637478-1-1d3e265e394f4acbad7a056e2b56d080
test (self-hosted, Windows, hfenduleam)	Test — Phase B (heavy class, serialized, on a now-quiet box)	2026-07-29T08:52:34.9058536Z   TMP: C:\actions-runner\_work\_temp\spt-test-tmp-30436637478-1-1d3e265e394f4acbad7a056e2b56d080
test (self-hosted, Windows, hfenduleam)	Test — Phase B (heavy class, serialized, on a now-quiet box)	2026-07-29T08:52:34.9058804Z ##[endgroup]
test (self-hosted, Windows, hfenduleam)	Test — Phase B (heavy class, serialized, on a now-quiet box)	2026-07-29T08:52:48.0953999Z     Finished `test` profile [unoptimized + debuginfo] target(s) in 4.56s
test (self-hosted, Windows, hfenduleam)	Test — Phase B (heavy class, serialized, on a now-quiet box)	2026-07-29T08:53:24.6774507Z ────────────
test (self-hosted, Windows, hfenduleam)	Test — Phase B (heavy class, serialized, on a now-quiet box)	2026-07-29T08:53:24.6774818Z  Nextest run ID bf3f1dfa-b995-4c51-a6bc-6283e5270ed2 with nextest profile: default
test (self-hosted, Windows, hfenduleam)	Test — Phase B (heavy class, serialized, on a now-quiet box)	2026-07-29T08:53:24.6775295Z     Starting 182 tests across 62 binaries (108 binaries skipped)
test (self-hosted, Windows, hfenduleam)	Test — Phase B (heavy class, serialized, on a now-quiet box)	2026-07-29T08:53:33.0952945Z         PASS [   8.416s] (  1/182) spt::attach_wedge_e2e attach_wedge_dead_child_plus_dropped_pump_does_not_wedge_the_broker
test (self-hosted, Windows, hfenduleam)	Test — Phase B (heavy class, serialized, on a now-quiet box)	2026-07-29T08:53:35.3333379Z         PASS [   2.238s] (  2/182) spt::bind_cwd_project_e2e endpoint_run_records_cwd_and_appears_under_its_project
test (self-hosted, Windows, hfenduleam)	Test — Phase B (heavy class, serialized, on a now-quiet box)	2026-07-29T08:53:36.9818423Z         PASS [   1.648s] (  3/182) spt::bind_honest_cross_perch_e2e cross_perch_dead_owner_repin_is_refused_no_contamination
test (self-hosted, Windows, hfenduleam)	Test — Phase B (heavy class, serialized, on a now-quiet box)	2026-07-29T08:53:51.3379735Z         PASS [  14.356s] (  4/182) spt::brain_respawn_rename brain_respawns_onto_applied_bytes_after_in_place_rename
test (self-hosted, Windows, hfenduleam)	Test — Phase B (heavy class, serialized, on a now-quiet box)	2026-07-29T08:53:58.7452920Z         PASS [   7.407s] (  5/182) spt::brain_split broker_survives_brain_kill_and_respawns_it
test (self-hosted, Windows, hfenduleam)	Test — Phase B (heavy class, serialized, on a now-quiet box)	2026-07-29T08:54:07.2285069Z         PASS [   8.481s] (  6/182) spt::brain_split seed_anchor_survives_brain_cycle
test (self-hosted, Windows, hfenduleam)	Test — Phase B (heavy class, serialized, on a now-quiet box)	2026-07-29T08:54:16.4964263Z         PASS [   9.270s] (  7/182) spt::brain_survive pty_and_quic_survive_brain_process_restart_onto_swapped_binary
test (self-hosted, Windows, hfenduleam)	Test — Phase B (heavy class, serialized, on a now-quiet box)	2026-07-29T08:54:20.9625736Z         PASS [   4.466s] (  8/182) spt::daemon_refresh_e2e daemon_refresh_cycles_brain_while_hosted_endpoint_survives
test (self-hosted, Windows, hfenduleam)	Test — Phase B (heavy class, serialized, on a now-quiet box)	2026-07-29T08:54:28.8901174Z         PASS [   7.927s] (  9/182) spt::dummy_harness_e2e endpoint_run_attach_awaits_online_before_attaching
test (self-hosted, Windows, hfenduleam)	Test — Phase B (heavy class, serialized, on a now-quiet box)	2026-07-29T08:54:32.0186936Z         PASS [   3.128s] ( 10/182) spt::dummy_harness_e2e endpoint_run_brings_up_a_long_lived_dummy_harness_and_rc_attaches
test (self-hosted, Windows, hfenduleam)	Test — Phase B (heavy class, serialized, on a now-quiet box)	2026-07-29T08:54:35.2139733Z         PASS [   3.195s] ( 11/182) spt::endpoint_teardown_authority_e2e shutdown_reaps_the_hosted_subtree_it_reports_suspending
test (self-hosted, Windows, hfenduleam)	Test — Phase B (heavy class, serialized, on a now-quiet box)	2026-07-29T08:54:43.7276224Z         PASS [   8.514s] ( 12/182) spt::endpoint_teardown_authority_e2e stop_reaps_the_hosted_subtree_and_run_recovers_the_endpoint
test (self-hosted, Windows, hfenduleam)	Test — Phase B (heavy class, serialized, on a now-quiet box)	2026-07-29T08:54:46.7346946Z         PASS [   3.007s] ( 13/182) spt::gateway_owner_shell_e2e gateway_typed_owner_owns_a_shell_on_every_path_keyed_on_id
test (self-hosted, Windows, hfenduleam)	Test — Phase B (heavy class, serialized, on a now-quiet box)	2026-07-29T08:54:51.0699735Z         PASS [   4.335s] ( 14/182) spt::job_escape_e2e win::cold_start_daemon_escapes_kill_on_close_job_via_wmi
test (self-hosted, Windows, hfenduleam)	Test — Phase B (heavy class, serialized, on a now-quiet box)	2026-07-29T08:54:54.4828995Z         PASS [   3.413s] ( 15/182) spt::job_escape_e2e win::wmi_daemon_run_has_no_conhost_window
test (self-hosted, Windows, hfenduleam)	Test — Phase B (heavy class, serialized, on a now-quiet box)	2026-07-29T08:54:57.4191683Z         PASS [   2.936s] ( 16/182) spt::live_adapt_translation_swap_e2e adapter_apply_for_foreign_adapter_leaves_live_endpoint_untouched
test (self-hosted, Windows, hfenduleam)	Test — Phase B (heavy class, serialized, on a now-quiet box)	2026-07-29T08:55:01.0092819Z         PASS [   3.590s] ( 17/182) spt::live_adapt_translation_swap_e2e adapter_apply_swaps_composite_profile_endpoint_matched_on_parent
test (self-hosted, Windows, hfenduleam)	Test — Phase B (heavy class, serialized, on a now-quiet box)	2026-07-29T08:55:04.1316334Z         PASS [   3.122s] ( 18/182) spt::live_adapt_translation_swap_e2e adapter_apply_swaps_locked_translation_binary_without_restarting_endpoint
test (self-hosted, Windows, hfenduleam)	Test — Phase B (heavy class, serialized, on a now-quiet box)	2026-07-29T08:55:06.0783168Z         PASS [   1.947s] ( 19/182) spt::live_adapt_translation_swap_e2e adapter_apply_with_no_matching_session_still_swaps
test (self-hosted, Windows, hfenduleam)	Test — Phase B (heavy class, serialized, on a now-quiet box)	2026-07-29T08:55:16.0783288Z         PASS [  10.000s] ( 20/182) spt::livehost_bootgate_e2e cold_start_does_not_revive_a_sessionless_online_latched_perch
test (self-hosted, Windows, hfenduleam)	Test — Phase B (heavy class, serialized, on a now-quiet box)	2026-07-29T08:55:20.4935008Z         PASS [   4.415s] ( 21/182) spt::multi_subnet_bringup_e2e fresh_unbound_is_attachable_before_bind
test (self-hosted, Windows, hfenduleam)	Test — Phase B (heavy class, serialized, on a now-quiet box)	2026-07-29T08:55:23.9528961Z         PASS [   3.459s] ( 22/182) spt::multi_subnet_bringup_e2e multi_subnet_refuses_without_subnet_then_homes_and_binds
test (self-hosted, Windows, hfenduleam)	Test — Phase B (heavy class, serialized, on a now-quiet box)	2026-07-29T08:55:26.8024021Z         PASS [   2.849s] ( 23/182) spt::multi_subnet_bringup_e2e single_subnet_control_auto_homes
test (self-hosted, Windows, hfenduleam)	Test — Phase B (heavy class, serialized, on a now-quiet box)	2026-07-29T08:55:26.8777021Z         PASS [   0.075s] ( 24/182) spt::n1_pairing new_brain_serves_against_old_broker
test (self-hosted, Windows, hfenduleam)	Test — Phase B (heavy class, serialized, on a now-quiet box)	2026-07-29T08:55:26.9426782Z         PASS [   0.065s] ( 25/182) spt::oneliner_e2e at_logon_task_launches_daemon_in_background_not_foreground
test (self-hosted, Windows, hfenduleam)	Test — Phase B (heavy class, serialized, on a now-quiet box)	2026-07-29T08:55:26.9519334Z         PASS [   0.009s] ( 26/182) spt::oneliner_e2e install_script_against_staged_release
test (self-hosted, Windows, hfenduleam)	Test — Phase B (heavy class, serialized, on a now-quiet box)	2026-07-29T08:55:32.4268662Z         PASS [   5.475s] ( 27/182) spt::projindex_reader_e2e readers_answer_from_daemon_maintained_index_with_zero_git
test (self-hosted, Windows, hfenduleam)	Test — Phase B (heavy class, serialized, on a now-quiet box)	2026-07-29T08:55:48.6796251Z         PASS [  16.253s] ( 28/182) spt::projindex_writer_e2e writer_cold_warm_and_event_invalidation_against_live_daemon
test (self-hosted, Windows, hfenduleam)	Test — Phase B (heavy class, serialized, on a now-quiet box)	2026-07-29T08:55:50.6684575Z         PASS [   1.989s] ( 29/182) spt::rc_attach_truth harness_only_refuses_truthfully_pre_stream
test (self-hosted, Windows, hfenduleam)	Test — Phase B (heavy class, serialized, on a now-quiet box)	2026-07-29T08:55:53.8667671Z         PASS [   3.198s] ( 30/182) spt::rc_attach_truth offline_row_over_live_session_attaches
test (self-hosted, Windows, hfenduleam)	Test — Phase B (heavy class, serialized, on a now-quiet box)	2026-07-29T08:55:55.8969647Z         PASS [   2.030s] ( 31/182) spt::rc_attach_truth offline_row_with_no_session_refuses
test (self-hosted, Windows, hfenduleam)	Test — Phase B (heavy class, serialized, on a now-quiet box)	2026-07-29T08:55:59.1851334Z         PASS [   3.288s] ( 32/182) spt::rc_attach_truth rc_owned_display_carries_no_pump_diagnostics
test (self-hosted, Windows, hfenduleam)	Test — Phase B (heavy class, serialized, on a now-quiet box)	2026-07-29T08:56:07.0217307Z         PASS [   7.837s] ( 33/182) spt::rc_attach_truth resume_never_bound_reads_unbound_and_attaches
test (self-hosted, Windows, hfenduleam)	Test — Phase B (heavy class, serialized, on a now-quiet box)	2026-07-29T08:56:13.7917549Z         FAIL [   6.767s] ( 34/182) spt::rc_attach_truth zombie_claim_refuses_never_attaches
test (self-hosted, Windows, hfenduleam)	Test — Phase B (heavy class, serialized, on a now-quiet box)	2026-07-29T08:56:13.7918092Z   stdout ───
test (self-hosted, Windows, hfenduleam)	Test — Phase B (heavy class, serialized, on a now-quiet box)	2026-07-29T08:56:13.7919068Z 
test (self-hosted, Windows, hfenduleam)	Test — Phase B (heavy class, serialized, on a now-quiet box)	2026-07-29T08:56:13.7919148Z     running 1 test
test (self-hosted, Windows, hfenduleam)	Test — Phase B (heavy class, serialized, on a now-quiet box)	2026-07-29T08:56:13.7919379Z     test zombie_claim_refuses_never_attaches ... FAILED
test (self-hosted, Windows, hfenduleam)	Test — Phase B (heavy class, serialized, on a now-quiet box)	2026-07-29T08:56:13.7919584Z 
test (self-hosted, Windows, hfenduleam)	Test — Phase B (heavy class, serialized, on a now-quiet box)	2026-07-29T08:56:13.7919642Z     failures:
test (self-hosted, Windows, hfenduleam)	Test — Phase B (heavy class, serialized, on a now-quiet box)	2026-07-29T08:56:13.7919736Z 
test (self-hosted, Windows, hfenduleam)	Test — Phase B (heavy class, serialized, on a now-quiet box)	2026-07-29T08:56:13.7919796Z     failures:
test (self-hosted, Windows, hfenduleam)	Test — Phase B (heavy class, serialized, on a now-quiet box)	2026-07-29T08:56:13.7919948Z         zombie_claim_refuses_never_attaches
test (self-hosted, Windows, hfenduleam)	Test — Phase B (heavy class, serialized, on a now-quiet box)	2026-07-29T08:56:13.7920109Z 
test (self-hosted, Windows, hfenduleam)	Test — Phase B (heavy class, serialized, on a now-quiet box)	2026-07-29T08:56:13.7920332Z     test result: FAILED. 0 passed; 1 failed; 0 ignored; 0 measured; 5 filtered out; finished in 6.76s
test (self-hosted, Windows, hfenduleam)	Test — Phase B (heavy class, serialized, on a now-quiet box)	2026-07-29T08:56:13.7920651Z 
test (self-hosted, Windows, hfenduleam)	Test — Phase B (heavy class, serialized, on a now-quiet box)	2026-07-29T08:56:13.7920757Z   stderr ───
test (self-hosted, Windows, hfenduleam)	Test — Phase B (heavy class, serialized, on a now-quiet box)	2026-07-29T08:56:13.7921441Z     MANIFEST_DEAD_KEY:zombieharness: [session.psyche_init] references `{psyche_dir}`, not a fillable key — this role is retired (never spawned); remove the dead reference
test (self-hosted, Windows, hfenduleam)	Test — Phase B (heavy class, serialized, on a now-quiet box)	2026-07-29T08:56:13.7922625Z 
test (self-hosted, Windows, hfenduleam)	Test — Phase B (heavy class, serialized, on a now-quiet box)	2026-07-29T08:56:13.7922830Z     thread 'zombie_claim_refuses_never_attaches' (15232) panicked at crates\spt\tests\rc_attach_truth.rs:422:5:
test (self-hosted, Windows, hfenduleam)	Test — Phase B (heavy class, serialized, on a now-quiet box)	2026-07-29T08:56:13.7923187Z     rc must name the dead-client-tree claim, never attach it.
test (self-hosted, Windows, hfenduleam)	Test — Phase B (heavy class, serialized, on a now-quiet box)	2026-07-29T08:56:13.7923382Z     === rc stdout ===
test (self-hosted, Windows, hfenduleam)	Test — Phase B (heavy class, serialized, on a now-quiet box)	2026-07-29T08:56:13.7923466Z 
test (self-hosted, Windows, hfenduleam)	Test — Phase B (heavy class, serialized, on a now-quiet box)	2026-07-29T08:56:13.7923581Z     [detached — 'zomb1' still running]
test (self-hosted, Windows, hfenduleam)	Test — Phase B (heavy class, serialized, on a now-quiet box)	2026-07-29T08:56:13.7923697Z 
test (self-hosted, Windows, hfenduleam)	Test — Phase B (heavy class, serialized, on a now-quiet box)	2026-07-29T08:56:13.7923831Z     note: run with `RUST_BACKTRACE=1` environment variable to display a backtrace
test (self-hosted, Windows, hfenduleam)	Test — Phase B (heavy class, serialized, on a now-quiet box)	2026-07-29T08:56:13.7924016Z 
test (self-hosted, Windows, hfenduleam)	Test — Phase B (heavy class, serialized, on a now-quiet box)	2026-07-29T08:56:21.3691654Z         PASS [   7.577s] ( 35/182) spt::resume_template_e2e endpoint_run_resume_selects_resume_template_in_recorded_cwd
test (self-hosted, Windows, hfenduleam)	Test — Phase B (heavy class, serialized, on a now-quiet box)	2026-07-29T08:56:24.6411855Z         PASS [   3.272s] ( 36/182) spt::run_no_dup_session_e2e run_over_live_endpoint_never_mints_a_second_session
test (self-hosted, Windows, hfenduleam)	Test — Phase B (heavy class, serialized, on a now-quiet box)	2026-07-29T08:56:24.8615303Z         PASS [   0.220s] ( 37/182) spt-daemon::attach attach_registers_remote_drive_detection
test (self-hosted, Windows, hfenduleam)	Test — Phase B (heavy class, serialized, on a now-quiet box)	2026-07-29T08:56:25.0322589Z         PASS [   0.171s] ( 38/182) spt-daemon::attach attach_survives_target_brain_restart_exactly_once
test (self-hosted, Windows, hfenduleam)	Test — Phase B (heavy class, serialized, on a now-quiet box)	2026-07-29T08:56:25.1027056Z         PASS [   0.070s] ( 39/182) spt-daemon::attach broker_spawns_the_pty_child_in_the_requested_cwd
test (self-hosted, Windows, hfenduleam)	Test — Phase B (heavy class, serialized, on a now-quiet box)	2026-07-29T08:56:25.1868336Z         PASS [   0.084s] ( 40/182) spt-daemon::attach controller_restart_with_viewer_no_displace_and_viewer_survives
test (self-hosted, Windows, hfenduleam)	Test — Phase B (heavy class, serialized, on a now-quiet box)	2026-07-29T08:56:25.2463420Z         PASS [   0.059s] ( 41/182) spt-daemon::attach controller_viewer_matrix_and_loud_take
test (self-hosted, Windows, hfenduleam)	Test — Phase B (heavy class, serialized, on a now-quiet box)	2026-07-29T08:56:25.2763759Z         PASS [   0.030s] ( 42/182) spt-daemon::attach handoff_seeds_resume_cursor_and_resubscribes_for_resume
test (self-hosted, Windows, hfenduleam)	Test — Phase B (heavy class, serialized, on a now-quiet box)	2026-07-29T08:56:26.2428773Z         PASS [   0.966s] ( 43/182) spt-daemon::attach local_attach_via_loopback_conn_rides_the_same_pump
test (self-hosted, Windows, hfenduleam)	Test — Phase B (heavy class, serialized, on a now-quiet box)	2026-07-29T08:56:26.3380991Z         PASS [   0.095s] ( 44/182) spt-daemon::attach loopback_attach_to_a_prepopulated_ring_delivers_without_deadlock
test (self-hosted, Windows, hfenduleam)	Test — Phase B (heavy class, serialized, on a now-quiet box)	2026-07-29T08:56:26.4006493Z         PASS [   0.062s] ( 45/182) spt-daemon::attach loopback_self_dial_is_refused_local_uses_fallback_transport
test (self-hosted, Windows, hfenduleam)	Test — Phase B (heavy class, serialized, on a now-quiet box)	2026-07-29T08:56:26.5175025Z         PASS [   0.117s] ( 46/182) spt-daemon::attach re_serve_resets_resume_cursor_after_a_pre_attached_consume
test (self-hosted, Windows, hfenduleam)	Test — Phase B (heavy class, serialized, on a now-quiet box)	2026-07-29T08:56:26.6876138Z         PASS [   0.170s] ( 47/182) spt-daemon::attach remote_attach_drives_a_real_pty_cross_daemon
test (self-hosted, Windows, hfenduleam)	Test — Phase B (heavy class, serialized, on a now-quiet box)	2026-07-29T08:56:26.8648128Z         PASS [   0.177s] ( 48/182) spt-daemon::attach resize_is_controller_exclusive
test (self-hosted, Windows, hfenduleam)	Test — Phase B (heavy class, serialized, on a now-quiet box)	2026-07-29T08:56:26.9580303Z         PASS [   0.093s] ( 49/182) spt-daemon::attach same_origin_re_subscribe_does_not_displace
test (self-hosted, Windows, hfenduleam)	Test — Phase B (heavy class, serialized, on a now-quiet box)	2026-07-29T08:56:27.0967569Z         PASS [   0.139s] ( 50/182) spt-daemon::attach spt_hosted_bringup_then_cross_node_attach_drives_the_pty
test (self-hosted, Windows, hfenduleam)	Test — Phase B (heavy class, serialized, on a now-quiet box)	2026-07-29T08:56:27.4799971Z         PASS [   0.383s] ( 51/182) spt-daemon::attach wedged_viewer_does_not_stall_controller
test (self-hosted, Windows, hfenduleam)	Test — Phase B (heavy class, serialized, on a now-quiet box)	2026-07-29T08:56:28.1704540Z         PASS [   0.690s] ( 52/182) spt-daemon::brain_swap brain_only_update_swaps_logic_with_zero_endpoint_interruption
test (self-hosted, Windows, hfenduleam)	Test — Phase B (heavy class, serialized, on a now-quiet box)	2026-07-29T08:56:28.5189416Z         PASS [   0.348s] ( 53/182) spt-daemon::broker ack_false_input_suppresses
[…2440ln elided…]
s_noop
test (self-hosted, Linux, kitsubito)	Test — Phase A (light pool; full parallel on Linux, bounded on Windows)	2026-07-29T08:48:57.0057898Z         PASS [   0.004s] (1868/2072) spt-store recent_home::tests::legacy_single_value_reads_as_one_element
test (self-hosted, Linux, kitsubito)	Test — Phase A (light pool; full parallel on Linux, bounded on Windows)	2026-07-29T08:48:57.0061023Z         PASS [   0.005s] (1869/2072) spt-store recent_home::tests::mru_less_project_falls_back_to_node_global
test (self-hosted, Linux, kitsubito)	Test — Phase A (light pool; full parallel on Linux, bounded on Windows)	2026-07-29T08:48:57.0069760Z         PASS [   0.006s] (1870/2072) spt-store recent_home::tests::node_global_moves_to_front
test (self-hosted, Linux, kitsubito)	Test — Phase A (light pool; full parallel on Linux, bounded on Windows)	2026-07-29T08:48:57.0109601Z         PASS [   0.005s] (1871/2072) spt-store recent_home::tests::record_updates_both_levels
test (self-hosted, Linux, kitsubito)	Test — Phase A (light pool; full parallel on Linux, bounded on Windows)	2026-07-29T08:48:57.0113547Z         PASS [   0.006s] (1872/2072) spt-store recent_home::tests::project_then_node_global_precedence
test (self-hosted, Linux, kitsubito)	Test — Phase A (light pool; full parallel on Linux, bounded on Windows)	2026-07-29T08:48:57.0135746Z         PASS [   0.022s] (1873/2072) spt-store psyche_custody::tests::custody_squatter_finds_the_holding_psyche_and_misses_others
test (self-hosted, Linux, kitsubito)	Test — Phase A (light pool; full parallel on Linux, bounded on Windows)	2026-07-29T08:48:57.0283058Z         PASS [   0.058s] (1874/2072) spt-store project::tests::display_derivation
test (self-hosted, Linux, kitsubito)	Test — Phase A (light pool; full parallel on Linux, bounded on Windows)	2026-07-29T08:48:57.0359998Z         PASS [   0.631s] (1875/2072) spt-store contextstore::tests::remove_endpoint_removes_exactly_the_source
test (self-hosted, Linux, kitsubito)	Test — Phase A (light pool; full parallel on Linux, bounded on Windows)	2026-07-29T08:48:57.0450842Z         PASS [   0.078s] (1876/2072) spt-store project::tests::derivation_ladder
test (self-hosted, Linux, kitsubito)	Test — Phase A (light pool; full parallel on Linux, bounded on Windows)	2026-07-29T08:48:57.0720174Z         PASS [   0.027s] (1877/2072) spt-store rename::tests::live_nested_child_blocks_rename
test (self-hosted, Linux, kitsubito)	Test — Phase A (light pool; full parallel on Linux, bounded on Windows)	2026-07-29T08:48:57.0834566Z         PASS [   0.072s] (1878/2072) spt-store registry::tests::register_on_nonexistent_owlery_creates_dir_and_succeeds
test (self-hosted, Linux, kitsubito)	Test — Phase A (light pool; full parallel on Linux, bounded on Windows)	2026-07-29T08:48:57.0840065Z         PASS [   0.073s] (1879/2072) spt-store registry::tests::register_and_lookup
test (self-hosted, Linux, kitsubito)	Test — Phase A (light pool; full parallel on Linux, bounded on Windows)	2026-07-29T08:48:57.0882272Z         PASS [   0.004s] (1880/2072) spt-store resume_custody::tests::corrupt_record_is_not_custody
test (self-hosted, Linux, kitsubito)	Test — Phase A (light pool; full parallel on Linux, bounded on Windows)	2026-07-29T08:48:57.1018744Z         PASS [   0.066s] (1881/2072) spt-store registry::tests::resolve_on_empty_registry_is_none_not_error
test (self-hosted, Linux, kitsubito)	Test — Phase A (light pool; full parallel on Linux, bounded on Windows)	2026-07-29T08:48:57.1062090Z         PASS [   0.004s] (1882/2072) spt-store resume_custody::tests::legacy_bare_pid_file_is_deleted_and_never_honored
test (self-hosted, Linux, kitsubito)	Test — Phase A (light pool; full parallel on Linux, bounded on Windows)	2026-07-29T08:48:57.1073284Z         PASS [   0.019s] (1883/2072) spt-store resume_custody::tests::dead_pid_reads_not_ours
test (self-hosted, Linux, kitsubito)	Test — Phase A (light pool; full parallel on Linux, bounded on Windows)	2026-07-29T08:48:57.1095064Z         PASS [   0.038s] (1884/2072) spt-store rename::tests::rename_refusals_leave_owlery_untouched
test (self-hosted, Linux, kitsubito)	Test — Phase A (light pool; full parallel on Linux, bounded on Windows)	2026-07-29T08:48:57.1250102Z         PASS [   0.015s] (1885/2072) spt-store resume_custody::tests::unproven_defers_exactly_one_tick
test (self-hosted, Linux, kitsubito)	Test — Phase A (light pool; full parallel on Linux, bounded on Windows)	2026-07-29T08:48:57.1293017Z         PASS [   0.004s] (1886/2072) spt-store roster::tests::is_member_any_spans_subnets_and_honors_tombstones
test (self-hosted, Linux, kitsubito)	Test — Phase A (light pool; full parallel on Linux, bounded on Windows)	2026-07-29T08:48:57.1298013Z         PASS [   0.024s] (1887/2072) spt-store resume_custody::tests::matching_pair_reads_ours_and_clear_removes_it
test (self-hosted, Linux, kitsubito)	Test — Phase A (light pool; full parallel on Linux, bounded on Windows)	2026-07-29T08:48:57.1306290Z         PASS [   0.840s] (1888/2072) spt-store atomic::tests::concurrent_writers_never_collide_on_tmp
test (self-hosted, Linux, kitsubito)	Test — Phase A (light pool; full parallel on Linux, bounded on Windows)	2026-07-29T08:48:57.1307845Z         PASS [   0.117s] (1889/2072) spt-store registry::tests::reregister_replaces_address
test (self-hosted, Linux, kitsubito)	Test — Phase A (light pool; full parallel on Linux, bounded on Windows)	2026-07-29T08:48:57.1339707Z         PASS [   0.005s] (1890/2072) spt-store roster::tests::merge_entry_is_strictly_greater_lease_wins
test (self-hosted, Linux, kitsubito)	Test — Phase A (light pool; full parallel on Linux, bounded on Windows)	2026-07-29T08:48:57.1340302Z         PASS [   0.004s] (1891/2072) spt-store roster::tests::merge_is_commutative_and_idempotent
test (self-hosted, Linux, kitsubito)	Test — Phase A (light pool; full parallel on Linux, bounded on Windows)	2026-07-29T08:48:57.1347386Z         PASS [   0.004s] (1892/2072) spt-store roster::tests::roster_for_projects_one_subnets_slice
test (self-hosted, Linux, kitsubito)	Test — Phase A (light pool; full parallel on Linux, bounded on Windows)	2026-07-29T08:48:57.1350742Z         PASS [   0.004s] (1893/2072) spt-store roster::tests::offline_member_persists_through_silence_and_reload
test (self-hosted, Linux, kitsubito)	Test — Phase A (light pool; full parallel on Linux, bounded on Windows)	2026-07-29T08:48:57.1369122Z         PASS [   0.029s] (1894/2072) spt-store resume_custody::tests::recycled_pid_reads_not_ours_and_the_record_is_deleted
test (self-hosted, Linux, kitsubito)	Test — Phase A (light pool; full parallel on Linux, bounded on Windows)	2026-07-29T08:48:57.1386473Z         PASS [   0.004s] (1895/2072) spt-store roster::tests::tombstones_are_scoped_and_merge
test (self-hosted, Linux, kitsubito)	Test — Phase A (light pool; full parallel on Linux, bounded on Windows)	2026-07-29T08:48:57.1387829Z         PASS [   0.005s] (1896/2072) spt-store roster::tests::tombstone_dominates_suppresses_reinsert_and_clears
test (self-hosted, Linux, kitsubito)	Test — Phase A (light pool; full parallel on Linux, bounded on Windows)	2026-07-29T08:48:57.1388734Z         PASS [   0.005s] (1897/2072) spt-store roster::tests::serde_additive_and_degrades_to_empty
test (self-hosted, Linux, kitsubito)	Test — Phase A (light pool; full parallel on Linux, bounded on Windows)	2026-07-29T08:48:57.1390332Z         PASS [   0.004s] (1898/2072) spt-store roster::tests::upsert_self_overwrites_unconditionally
test (self-hosted, Linux, kitsubito)	Test — Phase A (light pool; full parallel on Linux, bounded on Windows)	2026-07-29T08:48:57.1412007Z         PASS [   0.004s] (1899/2072) spt-store rotation::tests::coalesce_is_per_subnet
test (self-hosted, Linux, kitsubito)	Test — Phase A (light pool; full parallel on Linux, bounded on Windows)	2026-07-29T08:48:57.1430313Z         PASS [   0.004s] (1900/2072) spt-store rotation::tests::due_subnets_respects_deadline_and_force_is_immediate
test (self-hosted, Linux, kitsubito)	Test — Phase A (light pool; full parallel on Linux, bounded on Windows)	2026-07-29T08:48:57.1431281Z         PASS [   0.004s] (1901/2072) spt-store rotation::tests::coalesce_unions_revokees_and_keeps_earliest_deadline
test (self-hosted, Linux, kitsubito)	Test — Phase A (light pool; full parallel on Linux, bounded on Windows)	2026-07-29T08:48:57.1431933Z         PASS [   0.004s] (1902/2072) spt-store seed::tests::absent_cwd_is_omitted
test (self-hosted, Linux, kitsubito)	Test — Phase A (light pool; full parallel on Linux, bounded on Windows)	2026-07-29T08:48:57.1439288Z         PASS [   0.005s] (1903/2072) spt-store rotation::tests::persists_and_degrades_to_empty
test (self-hosted, Linux, kitsubito)	Test — Phase A (light pool; full parallel on Linux, bounded on Windows)	2026-07-29T08:48:57.1458860Z         PASS [   0.005s] (1904/2072) spt-store seed::tests::seed_round_trips_through_json
test (self-hosted, Linux, kitsubito)	Test — Phase A (light pool; full parallel on Linux, bounded on Windows)	2026-07-29T08:48:57.1459793Z         PASS [   0.063s] (1905/2072) spt-store rename::tests::rename_ripples_self_and_nested_children
test (self-hosted, Linux, kitsubito)	Test — Phase A (light pool; full parallel on Linux, bounded on Windows)	2026-07-29T08:48:57.1484849Z         PASS [   0.005s] (1906/2072) spt-store sessions::tests::appends_and_reads_in_order
test (self-hosted, Linux, kitsubito)	Test — Phase A (light pool; full parallel on Linux, bounded on Windows)	2026-07-29T08:48:57.1486491Z         PASS [   0.005s] (1907/2072) spt-store sessions::tests::adapter_field_roundtrips_and_survives_append
test (self-hosted, Linux, kitsubito)	Test — Phase A (light pool; full parallel on Linux, bounded on Windows)	2026-07-29T08:48:57.1494980Z         PASS [   0.006s] (1908/2072) spt-store sessions::tests::append_stamps_monotonic_ordinals
test (self-hosted, Linux, kitsubito)	Test — Phase A (light pool; full parallel on Linux, bounded on Windows)	2026-07-29T08:48:57.1503193Z         PASS [   0.004s] (1909/2072) spt-store sessions::tests::none_cwd_emits_no_field_and_roundtrips
test (self-hosted, Linux, kitsubito)	Test — Phase A (light pool; full parallel on Linux, bounded on Windows)	2026-07-29T08:48:57.1506309Z         PASS [   0.005s] (1910/2072) spt-store sessions::tests::pre_migration_row_without_adapter_deserializes_as_none
test (self-hosted, Linux, kitsubito)	Test — Phase A (light pool; full parallel on Linux, bounded on Windows)	2026-07-29T08:48:57.1535900Z         PASS [   0.005s] (1911/2072) spt-store sessions::tests::pre_migration_row_without_cwd_deserializes_as_none
test (self-hosted, Linux, kitsubito)	Test — Phase A (light pool; full parallel on Linux, bounded on Windows)	2026-07-29T08:48:57.1540440Z         PASS [   0.005s] (1912/2072) spt-store sessions::tests::pre_migration_rows_backfill_to_index_on_append
test (self-hosted, Linux, kitsubito)	Test — Phase A (light pool; full parallel on Linux, bounded on Windows)	2026-07-29T08:48:57.1551291Z         PASS [   0.005s] (1913/2072) spt-store sessions::tests::row_with_cwd_appends_and_reads_back
test (self-hosted, Linux, kitsubito)	Test — Phase A (light pool; full parallel on Linux, bounded on Windows)	2026-07-29T08:48:57.1552294Z         PASS [   0.005s] (1914/2072) spt-store sessions::tests::same_session_rebind_is_deduped
test (self-hosted, Linux, kitsubito)	Test — Phase A (light pool; full parallel on Linux, bounded on Windows)	2026-07-29T08:48:57.1586286Z         PASS [   0.005s] (1915/2072) spt-store sessions::tests::tolerant_of_garbage_lines
test (self-hosted, Linux, kitsubito)	Test — Phase A (light pool; full parallel on Linux, bounded on Windows)	2026-07-29T08:48:57.1599151Z         PASS [   0.005s] (1916/2072) spt-store shellinfo::tests::derivation_never_promotes_offline_to_online
test (self-hosted, Linux, kitsubito)	Test — Phase A (light pool; full parallel on Linux, bounded on Windows)	2026-07-29T08:48:57.1602457Z         PASS [   0.006s] (1917/2072) spt-store shellinfo::tests::alias_unique_rename_and_resolution
test (self-hosted, Linux, kitsubito)	Test — Phase A (light pool; full parallel on Linux, bounded on Windows)	2026-07-29T08:48:57.1607173Z         PASS [   0.006s] (1918/2072) spt-store shellinfo::tests::composite_option_mints_colon_free_id_and_carries_the_composite
test (self-hosted, Linux, kitsubito)	Test — Phase A (light pool; full parallel on Linux, bounded on Windows)	2026-07-29T08:48:57.1610479Z         PASS [   0.155s] (1919/2072) spt-store registry::tests::clean_removes_dead_keeps_live
test (self-hosted, Linux, kitsubito)	Test — Phase A (light pool; full parallel on Linux, bounded on Windows)	2026-07-29T08:48:57.1647608Z         PASS [   0.006s] (1920/2072) spt-store shellinfo::tests::mint_smallest_free_and_teardown_frees
test (self-hosted, Linux, kitsubito)	Test — Phase A (light pool; full parallel on Linux, bounded on Windows)	2026-07-29T08:48:57.1651477Z         PASS [   0.159s] (1921/2072) spt-store registry::tests::clean_keys_on_status_for_daemon_hosted_rows
test (self-hosted, Linux, kitsubito)	Test — Phase A (light pool; full parallel on Linux, bounded on Windows)	2026-07-29T08:48:57.1654610Z         PASS [   0.005s] (1922/2072) spt-store shellinfo::tests::shellinfo_roundtrip_and_corrupt_tolerance
test (self-hosted, Linux, kitsubito)	Test — Phase A (light pool; full parallel on Linux, bounded on Windows)	2026-07-29T08:48:57.1655516Z         PASS [   0.006s] (1923/2072) spt-store shellinfo::tests::online_derives_offline_only_for_a_provably_dead_pid
test (self-hosted, Linux, kitsubito)	Test — Phase A (light pool; full parallel on Linux, bounded on Windows)	2026-07-29T08:48:57.1749727Z         PASS [   0.031s] (1924/2072) spt-store sessions::tests::last_k_and_bounding
test (self-hosted, Linux, kitsubito)	Test — Phase A (light pool; full parallel on Linux, bounded on Windows)	2026-07-29T08:48:57.1760151Z         LEAK [   0.225s] (1925/2072) spt-store proc::tests::process_cmdline_reads_a_live_arg_marker
test (self-hosted, Linux, kitsubito)	Test — Phase A (light pool; full parallel on Linux, bounded on Windows)	2026-07-29T08:48:57.1802574Z         PASS [   0.152s] (1926/2072) spt-store registry::tests::resolve_cleans_before_lookup
test (self-hosted, Linux, kitsubito)	Test — Phase A (light pool; full parallel on Linux, bounded on Windows)	2026-07-29T08:48:57.1811403Z         PASS [   0.032s] (1927/2072) spt-store sessions::tests::prune_does_not_renumber_surviving_ordinals
test (self-hosted, Linux, kitsubito)	Test — Phase A (light pool; full parallel on Linux, bounded on Windows)	2026-07-29T08:48:57.3360305Z         PASS [   0.171s] (1928/2072) spt-store spool::tests::claim_idle_edge_audited_stamps_idle_inject_leg
test (self-hosted, Linux, kitsubito)	Test — Phase A (light pool; full parallel on Linux, bounded on Windows)	2026-07-29T08:48:57.3749864Z         PASS [   0.200s] (1929/2072) spt-store spool::tests::drain_marks_delivered_and_is_idempotent
test (self-hosted, Linux, kitsubito)	Test — Phase A (light pool; full parallel on Linux, bounded on Windows)	2026-07-29T08:48:57.4082307Z         PASS [   0.243s] (1930/2072) spt-store spool::tests::deferred_row_survives_event_drain_then_hook_delivers
test (self-hosted, Linux, kitsubito)	Test — Phase A (light pool; full parallel on Linux, bounded on Windows)	2026-07-29T08:48:57.4111593Z         PASS [   0.235s] (1931/2072) spt-store spool::tests::drain_take_ack_is_double_deliver_safe
test (self-hosted, Linux, kitsubito)	Test — Phase A (light pool; full parallel on Linux, bounded on Windows)	2026-07-29T08:48:57.4419632Z         PASS [   0.435s] (1932/2072) spt-store registry::tests::concurrent_registration_never_locks
test (self-hosted, Linux, kitsubito)	Test — Phase A (light pool; full parallel on Linux, bounded on Windows)	2026-07-29T08:48:57.4455143Z         PASS [   0.280s] (1933/2072) spt-store spool::tests::deferred_mirrors_active_only_window_across_all_three
test (self-hosted, Linux, kitsubito)	Test — Phase A (light pool; full parallel on Linux, bounded on Windows)	2026-07-29T08:48:57.4629454Z         PASS [   0.283s] (1934/2072) spt-store spool::tests::evaporate_drops_only_ephemeral_non_deferred_undelivered
test (self-hosted, Linux, kitsubito)	Test — Phase A (light pool; full parallel on Linux, bounded on Windows)	2026-07-29T08:48:57.5204774Z         PASS [   0.355s] (1935/2072) spt-store spool::tests::concurrent_take_yields_exactly_one_winner
test (self-hosted, Linux, kitsubito)	Test — Phase A (light pool; full parallel on Linux, bounded on Windows)	2026-07-29T08:48:57.5354506Z         PASS [   0.375s] (1936/2072) spt-store spool::tests::active_window_drain_suppresses_idle_only_and_honors_include_deferred
test (self-hosted, Linux, kitsubito)	Test — Phase A (light pool; full parallel on Linux, bounded on Windows)	2026-07-29T08:48:57.5458429Z         PASS [   0.385s] (1937/2072) spt-store spool::tests::audited_take_records_taker_provenance_unaudited_leaves_null
test (self-hosted, Linux, kitsubito)	Test — Phase A (light pool; full parallel on Linux, bounded on Windows)	2026-07-29T08:48:57.5902182Z         PASS [   0.254s] (1938/2072) spt-store spool::tests::idle_edge_claims_never_take_a_deferred_row
test (self-hosted, Linux, kitsubito)	Test — Phase A (light pool; full parallel on Linux, bounded on Windows)	2026-07-29T08:48:57.5946957Z         PASS [   0.004s] (1939/2072) spt-store subnet::tests::add_joined_preserves_seed_and_epoch
test (self-hosted, Linux, kitsubito)	Test — Phase A (light pool; full parallel on Linux, bounded on Windows)	2026-07-29T08:48:57.5988205Z         PASS [   0.004s] (1940/2072) spt-store subnet::tests::adopt_rotation_takes_newer_seed_and_is_idempotent
test (self-hosted, Linux, kitsubito)	Test — Phase A (light pool; full parallel on Linux, bounded on Windows)	2026-07-29T08:48:57.6030445Z         PASS [   0.004s] (1941/2072) spt-store subnet::tests::create_subnet_starts_at_epoch_one_unique_name
test (self-hosted, Linux, kitsubito)	Test — Phase A (light pool; full parallel on Linux, bounded on Windows)	2026-07-29T08:48:57.6069358Z         PASS [   0.004s] (1942/2072) spt-store subnet::tests::hex_round_trips_and_rejects_bad_input
test (self-hosted, Linux, kitsubito)	Test — Phase A (light pool; full parallel on Linux, bounded on Windows)	2026-07-29T08:48:57.6095332Z         PASS [   0.147s] (1943/2072) spt-store spool::tests::sentinel_create_fail_warns_once_nonfatal
test (self-hosted, Linux, kitsubito)	Test — Phase A (light pool; full parallel on Linux, bounded on Windows)	2026-07-29T08:48:57.6116391Z         PASS [   0.005s] (1944/2072) spt-store subnet::tests::hide_new_endpoints_defaults_off_and_persists
test (self-hosted, Linux, kitsubito)	Test — Phase A (light pool; full parallel on Linux, bounded on Windows)	2026-07-29T08:48:57.6140034Z         PASS [   0.004s] (1945/2072) spt-store subnet::tests::minted_seeds_are_random
test (self-hosted, Linux, kitsubito)	Test — Phase A (light pool; full parallel on Linux, bounded on Windows)	2026-07-29T08:48:57.6158526Z         PASS [   0.004s] (1946/2072) spt-store subnet::tests::missing_or_corrupt_file_is_empty_store
test (self-hosted, Linux, kitsubito)	Test — Phase A (light pool; full parallel on Linux, bounded on Windows)	2026-07-29T08:48:57.6185205Z         PASS [   0.173s] (1947/2072) spt-store spool::tests::reopen_is_idempotent
test (self-hosted, Linux, kitsubito)	Test — Phase A (light pool; full parallel on Linux, bounded on Windows)	2026-07-29T08:48:57.6186024Z         PASS [   0.437s] (1948/2072) spt-store spool::tests::event_part_body_persists_byte_exact
test (self-hosted, Linux, kitsubito)	Test — Phase A (light pool; full parallel on Linux, bounded on Windows)	2026-07-29T08:48:57.6187843Z         PASS [   0.005s] (1949/2072) spt-store subnet::tests::no_prior_generation_before_rotation
test (self-hosted, Linux, kitsubito)	Test — Phase A (light pool; full parallel on Linux, bounded on Windows)	2026-07-29T08:48:57.6210579Z         PASS [   0.005s] (1950/2072) spt-store subnet::tests::remove_drops_membership
test (self-hosted, Linux, kitsubito)	Test — Phase A (light pool; full parallel on Linux, bounded on Windows)	2026-07-29T08:48:57.6231113Z         PASS [   0.004s] (1951/2072) spt-store subnet::tests::rotate_bumps_epoch_and_changes_seed
test (self-hosted, Linux, kitsubito)	Test — Phase A (light pool; full parallel on Linux, bounded on Windows)	2026-07-29T08:48:57.6235429Z         PASS [   0.005s] (1952/2072) spt-store subnet::tests::store_persists_multi_subnet_and_rotation
test (self-hosted, Linux, kitsubito)	Test — Phase A (light pool; full parallel on Linux, bounded on Windows)	2026-07-29T08:48:57.6473314Z         PASS [   0.239s] (1953/2072) spt-store spool::tests::non_deferred_drain_skips_deferred_and_preserves_order
test (self-hosted, Linux, kitsubito)	Test — Phase A (light pool; full parallel on Linux, bounded on Windows)	2026-07-29T08:48:57.6543017Z         PASS [   1.357s] (1954/2072) spt-store branchstore::tests::branches_by_recency_orders_newest_first
test (self-hosted, Linux, kitsubito)	Test — Phase A (light pool; full parallel on Linux, bounded on Windows)	2026-07-29T08:48:57.6631245Z         PASS [   0.143s] (1955/2072) spt-store spool::tests::spool_touches_has_messages_sentinel
test (self-hosted, Linux, kitsubito)	Test — Phase A (light pool; full parallel on Linux, bounded on Windows)	2026-07-29T08:48:57.6798609Z         PASS [   0.305s] (1956/2072) spt-store spool::tests::no_binary_idle_drain_spools_not_pty
test (self-hosted, Linux, kitsubito)	Test — Phase A (light pool; full parallel on Linux, bounded on Windows)	2026-07-29T08:48:57.6802796Z         PASS [   0.238s] (1957/2072) spt-store spool::tests::release_clears_taker_audit_then_retake_restamps
test (self-hosted, Linux, kitsubito)	Test — Phase A (light pool; full parallel on Linux, bounded on Windows)	2026-07-29T08:48:57.6810340Z         PASS [   0.146s] (1958/2072) spt-store spool::tests::wan_mark_seen_claims_once_and_blocks_spool_path
test (self-hosted, Linux, kitsubito)	Test — Phase A (light pool; full parallel on Linux, bounded on Windows)	2026-07-29T08:48:57.6840477Z         PASS [   0.004s] (1959/2072) spt-store timefmt::tests::formats_known_instants
test (self-hosted, Linux, kitsubito)	Test — Phase A (light pool; full parallel on Linux, bounded on Windows)	2026-07-29T08:48:57.6841722Z         PASS [   0.004s] (1960/2072) spt-store timefmt::tests::lexical_order_matches_chronological_order
test (self-hosted, Linux, kitsubito)	Test — Phase A (light pool; full parallel on Linux, bounded on Windows)	2026-07-29T08:48:57.6849497Z         PASS [   0.004s] (1961/2072) spt-store visibility::tests::hidden_gates_sync_even_when_listed
test (self-hosted, Linux, kitsubito)	Test — Phase A (light pool; full parallel on Linux, bounded on Windows)	2026-07-29T08:48:57.6881525Z         PASS [   0.004s] (1962/2072) spt-store visibility::tests::override_wins_both_directions
test (self-hosted, Linux, kitsubito)	Test — Phase A (light pool; full parallel on Linux, bounded on Windows)	2026-07-29T08:48:57.6882246Z         PASS [   0.004s] (1963/2072) spt-store visibility::tests::hidden_is_or_of_defaults
test (self-hosted, Linux, kitsubito)	Test — Phase A (light pool; full parallel on Linux, bounded on Windows)	2026-07-29T08:48:57.6897481Z         PASS [   0.005s] (1964/2072) spt-store visibility::tests::store_persists_and_degrades_safe
test (self-hosted, Linux, kitsubito)	Test — Phase A (light pool; full parallel on Linux, bounded on Windows)	2026-07-29T08:48:57.6926355Z         PASS [   0.004s] (1965/2072) spt-store worker_reap::tests::clamp_ttl_floors_fat_finger_but_allows_disable
test (self-hosted, Linux, kitsubito)	Test — Phase A (light pool; full parallel on Linux, bounded on Windows)	2026-07-29T08:48:57.6927072Z         PASS [   0.004s] (1966/2072) spt-store visibility::tests::synced_requires_membership_listing
test (self-hosted, Linux, kitsubito)	Test — Phase A (light pool; full parallel on Linux, bounded on Windows)	2026-07-29T08:48:57.6938032Z         PASS [   0.046s] (1967/2072) spt-store syncmerge::tests::non_context_branch_refused
test (self-hosted, Linux, kitsubito)	Test — Phase A (light pool; full parallel on Linux, bounded on Windows)	2026-07-29T08:48:57.7136887Z         PASS [   0.021s] (1968/2072) spt-store worker_reap::tests::never_touches_a_psyche
test (self-hosted, Linux, kitsubito)	Test — Phase A (light pool; full parallel on Linux, bounded on Windows)	2026-07-29T08:48:57.7179565Z         PASS [   0.172s] (1969/2072) spt-store spool::tests::wan_spool_dedups_on_op_id_across_reopen
test (self-hosted, Linux, kitsubito)	Test — Phase A (light pool; full parallel on Linux, bounded on Windows)	2026-07-29T08:48:57.7576448Z         PASS [   0.346s] (1970/2072) spt-store spool::tests::poll_taken_row_never_idle_injected_but_untaken_row_still_claimable
test (self-hosted, Linux, kitsubito)	Test — Phase A (light pool; full parallel on Linux, bounded on Windows)	2026-07-29T08:48:57.7836633Z         PASS [   0.026s] (1971/2072) spt-store worker_seq::tests::counter_survives_reap_no_reuse
test (self-hosted, Linux, kitsubito)	Test — Phase A (light pool; full parallel on Linux, bounded on Windows)	2026-07-29T08:48:57.7987039Z         PASS [   5.812s] (1972/2072) spt-daemon::pump pump_survives_a_black_holing_peer_heartbeat_advances_no_restart
test (self-hosted, Linux, kitsubito)	Test — Phase A (light pool; full parallel on Linux, bounded on Windows)	2026-07-29T08:48:57.8037629Z         PASS [   0.005s] (1973/2072) spt-store xfer::tests::progress_round_trips_per_role_and_updates_mid_flight
test (self-hosted, Linux, kitsubito)	Test — Phase A (light pool; full parallel on Linux, bounded on Windows)	2026-07-29T08:48:57.8081322Z         PASS [   0.004s] (1974/2072) spt-store xfer::tests::xfer_id_is_filename_safe_and_distinct
test (self-hosted, Linux, kitsubito)	Test — Phase A (light pool; full parallel on Linux, bounded on Windows)	2026-07-29T08:48:57.8255232Z         PASS [   0.042s] (1975/2072) spt-store worker_seq::tests::mints_monotonic_per_parent
test (self-hosted, Linux, kitsubito)	Test — Phase A (light pool; full parallel on Linux, bounded on Windows)	2026-07-29T08:48:57.8295826Z         PASS [   0.004s] (1976/2072) spt-term digest::tests::config_defaults_are_the_presentation_formula
test (self-hosted, Linux, kitsubito)	Test — Phase A (light pool; full parallel on Linux, bounded on Windows)	2026-07-29T08:48:57.8336304Z         PASS [   0.004s] (1977/2072) spt-term digest::tests::truncate_arg_cuts_to_width_with_ellipsis
test (self-hosted, Linux, kitsubito)	Test — Phase A (light pool; full parallel on Linux, bounded on Windows)	2026-07-29T08:48:57.8377847Z         PASS [   0.004s] (1978/2072) spt-term projection::tests::a_post_seal_straggler_folds_in_without_moving_a_published_seq
test (self-hosted, Linux, kitsubito)	Test — Phase A (light pool; full parallel on Linux, bounded on Windows)	2026-07-29T08:48:57.8419580Z         PASS [   0.004s] (1979/2072) spt-term projection::tests::a_sealed_sprint_grows_forward_only_keeping_the_turn_anchor_stable
test (self-hosted, Linux, kitsubito)	Test — Phase A (light pool; full parallel on Linux, bounded on Windows)	2026-07-29T08:48:57.8459248Z         PASS [   0.004s] (1980/2072) spt-term projection::tests::agent_between_tools_breaks_the_sprint
test (self-hosted, Linux, kitsubito)	Test — Phase A (light pool; full parallel on Linux, bounded on Windows)	2026-07-29T08:48:57.8499370Z         PASS [   0.004s] (1981/2072) spt-term projection::tests::context_record_discriminator
test (self-hosted, Linux, kitsubito)	Test — Phase A (light pool; full parallel on Linux, bounded on Windows)	2026-07-29T08:48:57.8538209Z         PASS [   0.004s] (1982/2072) spt-term projection::tests::crux_committed_seqs_survive_a_turn_window_slide
test (self-hosted, Linux, kitsubito)	Test — Phase A (light pool; full parallel on Linux, bounded on Windows)	2026-07-29T08:48:57.8576287Z         PASS [   0.004s] (1983/2072) spt-term projection::tests::diagnostics_clean_stream_has_no_drops
test (self-hosted, Linux, kitsubito)	Test — Phase A (light pool; full parallel on Linux, bounded on Windows)	2026-07-29T08:48:57.8614510Z         PASS [   0.004s] (1984/2072) spt-term projection::tests::diagnostics_record_every_drop_with_reason
test (self-hosted, Linux, kitsubito)	Test — Phase A (light pool; full parallel on Linux, bounded on Windows)	2026-07-29T08:48:57.8657543Z         PASS [   0.004s] (1985/2072) spt-term projection::tests::empty_input_projects_empty_digest
test (self-hosted, Linux, kitsubito)	Test — Phase A (light pool; full parallel on Linux, bounded on Windows)	2026-07-29T08:48:57.8699688Z         PASS [   0.004s] (1986/2072) spt-term projection::tests::idle_on_an_empty_or_single_turn_timeline_invents_nothing
test (self-hosted, Linux, kitsubito)	Test — Phase A (light pool; full parallel on Linux, bounded on Windows)	2026-07-29T08:48:57.8738609Z         PASS [   0.004s] (1987/2072) spt-term projection::tests::idle_seals_the_trailing_turn_while_busy_leaves_it_partial
test (self-hosted, Linux, kitsubito)	Test — Phase A (light pool; full parallel on Linux, bounded on Windows)	2026-07-29T08:48:57.8776962Z         PASS [   0.004s] (1988/2072) spt-term projection::tests::leading_output_without_input_is_a_preamble_turn
test (self-hosted, Linux, kitsubito)	Test — Phase A (light pool; full parallel on Linux, bounded on Windows)	2026-07-29T08:48:57.8817444Z         PASS [   0.004s] (1989/2072) spt-term projection::tests::malformed_unknown_role_and_toolless_tool_are_skipped
test (self-hosted, Linux, kitsubito)	Test — Phase A (light pool; full parallel on Linux, bounded on Windows)	2026-07-29T08:48:57.8858672Z         PASS [   0.004s] (1990/2072) spt-term projection::tests::partial_trailing_turn_has_no_seqs
test (self-hosted, Linux, kitsubito)	Test — Phase A (light pool; full parallel on Linux, bounded on Windows)	2026-07-29T08:48:57.8899115Z         PASS [   0.004s] (1991/2072) spt-term projection::tests::projects_input_agent_and_collapses_tool_sprints
test (self-hosted, Linux, kitsubito)	Test — Phase A (light pool; full parallel on Linux, bounded on Windows)	2026-07-29T08:48:57.8937821Z         PASS [   0.004s] (1992/2072) spt-term projection::tests::re_projecting_a_sealed_idle_timeline_is_identical
test (self-hosted, Linux, kitsubito)	Test — Phase A (light pool; full parallel on Linux, bounded on Windows)	2026-07-29T08:48:57.8977549Z         PASS [   0.004s] (1993/2072) spt-term projection::tests::sealing_survives_a_window_slide
test (self-hosted, Linux, kitsubito)	Test — Phase A (light pool; full parallel on Linux, bounded on Windows)	2026-07-29T08:48:57.9015711Z         PASS [   0.004s] (1994/2072) spt-term projection::tests::seq_encoding_total_order
test (self-hosted, Linux, kitsubito)	Test — Phase A (light pool; full parallel on Linux, bounded on Windows)	2026-07-29T08:48:57.9053265Z         PASS [   0.004s] (1995/2072) spt-term projection::tests::sprint_collapse_off_keeps_tools_separate
test (self-hosted, Linux, kitsubito)	Test — Phase A (light pool; full parallel on Linux, bounded on Windows)	2026-07-29T08:48:57.9066179Z         PASS [   0.189s] (1996/2072) spt-store worker_seq::tests::concurrent_mints_never_collide
test (self-hosted, Linux, kitsubito)	Test — Phase A (light pool; full parallel on Linux, bounded on Windows)	2026-07-29T08:48:57.9098437Z         PASS [   0.004s] (1997/2072) spt-term projection::tests::the_sealed_seq_equals_what_the_next_input_fallback_would_assign
test (self-hosted, Linux, kitsubito)	Test — Phase A (light pool; full parallel on Linux, bounded on Windows)	2026-07-29T08:48:57.9106600Z         PASS [   0.004s] (1998/2072) spt-term projection::tests::timeline_boundary_divider_and_window_bridge
test (self-hosted, Linux, kitsubito)	Test — Phase A (light pool; full parallel on Linux, bounded on Windows)	2026-07-29T08:48:57.9139447Z         PASS [   0.004s] (1999/2072) spt-term projection::tests::timeline_folds_context_into_a_turn
test (self-hosted, Linux, kitsubito)	Test — Phase A (light pool; full parallel on Linux, bounded on Windows)	2026-07-29T08:48:57.9149630Z         PASS [   0.004s] (2000/2072) spt-term projection::tests::tool_sprint_seq_is_last_collapsed_record
test (self-hosted, Linux, kitsubito)	Test — Phase A (light pool; full parallel on Linux, bounded on Windows)	2026-07-29T08:48:57.9179826Z         PASS [   0.004s] (2001/2072) spt-term projection::tests::truncates_tool_args_to_width
test (self-hosted, Linux, kitsubito)	Test — Phase A (light pool; full parallel on Linux, bounded on Windows)	2026-07-29T08:48:57.9194771Z         PASS [   0.004s] (2002/2072) spt-term projection::tests::ts_ordering_key_parses_and_is_optional
test (self-hosted, Linux, kitsubito)	Test — Phase A (light pool; full parallel on Linux, bounded on Windows)	2026-07-29T08:48:57.9221904Z         PASS [   0.004s] (2003/2072) spt-term projection::tests::unknown_fields_are_tolerated
test (self-hosted, Linux, kitsubito)	Test — Phase A (light pool; full parallel on Linux, bounded on Windows)	2026-07-29T08:48:57.9234440Z         PASS [   0.004s] (2004/2072) spt-term projection::tests::window_input_turns_bridges_and_trims
test (self-hosted, Linux, kitsubito)	Test — Phase A (light pool; full parallel on Linux, bounded on Windows)	2026-07-29T08:48:57.9262134Z         PASS [   0.004s] (2005/2072) spt-term projection::tests::windows_to_last_n_turns
test (self-hosted, Linux, kitsubito)	Test — Phase A (light pool; full parallel on Linux, bounded on Windows)	2026-07-29T08:48:57.9278744Z         PASS [   0.004s] (2006/2072) spt-term reader::tests::auto_answers_synthetic_dsr_query
test (self-hosted, Linux, kitsubito)	Test — Phase A (light pool; full parallel on Linux, bounded on Windows)	2026-07-29T08:48:57.9305561Z         PASS [   0.004s] (2007/2072) spt-term reader::tests::cursor_provider_yields_accurate_display_column_cpr
test (self-hosted, Linux, kitsubito)	Test — Phase A (light pool; full parallel on Linux, bounded on Windows)	2026-07-29T08:48:57.9317794Z         PASS [   0.004s] (2008/2072) spt-term reader::tests::dsr_splitter_finds_and_strips_query_across_chunk_boundary
test (self-hosted, Linux, kitsubito)	Test — Phase A (light pool; full parallel on Linux, bounded on Windows)	2026-07-29T08:48:57.9356060Z         PASS [   0.004s] (2009/2072) spt-term reader::tests::query_free_chunk_reaches_the_sink_as_one_segment
test (self-hosted, Linux, kitsubito)	Test — Phase A (light pool; full parallel on Linux, bounded on Windows)	2026-07-29T08:48:57.9395524Z         PASS [   0.009s] (2010/2072) spt-term reader::tests::no_dsr_means_no_answer
test (self-hosted, Linux, kitsubito)	Test — Phase A (light pool; full parallel on Linux, bounded on Windows)	2026-07-29T08:48:57.9396177Z         PASS [   0.004s] (2011/2072) spt-term screen::tests::a_sequence_split_across_captured_advances_defers_whole
test (self-hosted, Linux, kitsubito)	Test — Phase A (light pool; full parallel on Linux, bounded on Windows)	2026-07-29T08:48:57.9438545Z         PASS [   0.004s] (2012/2072) spt-term screen::tests::capture_consumes_tracked_state_instead_of_deferring_it
test (self-hosted, Linux, kitsubito)	Test — Phase A (light pool; full parallel on Linux, bounded on Windows)	2026-07-29T08:48:57.9445395Z         PASS [   0.005s] (2013/2072) spt-term screen::tests::alt_screen_repaint_excludes_main_scrollback
test (self-hosted, Linux, kitsubito)	Test — Phase A (light pool; full parallel on Linux, bounded on Windows)	2026-07-29T08:48:57.9480291Z         PASS [   0.004s] (2014/2072) spt-term screen::tests::capture_defers_osc_color_with_original_terminator
test (self-hosted, Linux, kitsubito)	Test — Phase A (light pool; full parallel on Linux, bounded on Windows)	2026-07-29T08:48:57.9483338Z         PASS [   0.004s] (2015/2072) spt-term screen::tests::capture_defers_untracked_stateful_one_shots_and_queries_in_order
test (self-hosted, Linux, kitsubito)	Test — Phase A (light pool; full parallel on Linux, bounded on Windows)	2026-07-29T08:48:57.9522855Z         PASS [   0.004s] (2016/2072) spt-term screen::tests::capture_drops_hyperlinks_dcs_and_dsr
test (self-hosted, Linux, kitsubito)	Test — Phase A (light pool; full parallel on Linux, bounded on Windows)	2026-07-29T08:48:57.9528143Z         PASS [   0.004s] (2017/2072) spt-term screen::tests::combining_mark_attaches_without_advancing
test (self-hosted, Linux, kitsubito)	Test — Phase A (light pool; full parallel on Linux, bounded on Windows)	2026-07-29T08:48:57.9566933Z         PASS [   0.004s] (2018/2072) spt-term screen::tests::cursor_position_reports_display_columns
test (self-hosted, Linux, kitsubito)	Test — Phase A (light pool; full parallel on Linux, bounded on Windows)	2026-07-29T08:48:57.9567800Z         PASS [   0.004s] (2019/2072) spt-term screen::tests::cursor_visibility_hidden_emitted
test (self-hosted, Linux, kitsubito)	Test — Phase A (light pool; full parallel on Linux, bounded on Windows)	2026-07-29T08:48:57.9616350Z         PASS [   0.005s] (2020/2072) spt-term screen::tests::empty_grid_repaint_is_clean
test (self-hosted, Linux, kitsubito)	Test — Phase A (light pool; full parallel on Linux, bounded on Windows)	2026-07-29T08:48:57.9618106Z         PASS [   0.005s] (2021/2072) spt-term screen::tests::dch_ich_heal_wide_pairs_at_the_boundaries
test (self-hosted, Linux, kitsubito)	Test — Phase A (light pool; full parallel on Linux, bounded on Windows)	2026-07-29T08:48:57.9618780Z         PASS [   0.269s] (2022/2072) spt-store worker_reap::tests::orphaned_respects_boot_race_grace
test (self-hosted, Linux, kitsubito)	Test — Phase A (light pool; full parallel on Linux, bounded on Windows)	2026-07-29T08:48:57.9664734Z         PASS [   0.004s] (2023/2072) spt-term screen::tests::erase_display_clears_screen
test (self-hosted, Linux, kitsubito)	Test — Phase A (light pool; full parallel on Linux, bounded on Windows)	2026-07-29T08:48:57.9665326Z         PASS [   0.004s] (2024/2072) spt-term screen::tests::leaving_alt_restores_main_screen
test (self-hosted, Linux, kitsubito)	Test — Phase A (light pool; full parallel on Linux, bounded on Windows)	2026-07-29T08:48:57.9667106Z         PASS [   0.005s] (2025/2072) spt-term screen::tests::erase_across_a_wide_half_leaves_no_orphan
test (self-hosted, Linux, kitsubito)	Test — Phase A (light pool; full parallel on Linux, bounded on Windows)	2026-07-29T08:48:57.9706808Z         PASS [   0.004s] (2026/2072) spt-term screen::tests::plain_advance_never_captures
test (self-hosted, Linux, kitsubito)	Test — Phase A (light pool; full parallel on Linux, bounded on Windows)	2026-07-29T08:48:57.9709298Z         PASS [   0.004s] (2027/2072) spt-term screen::tests::main_screen_repaint_paints_text_no_alt_enter
test (self-hosted, Linux, kitsubito)	Test — Phase A (light pool; full parallel on Linux, bounded on Windows)	2026-07-29T08:48:57.9714287Z         PASS [   0.005s] (2028/2072) spt-term screen::tests::overwriting_either_half_clears_the_whole_wide_glyph
test (self-hosted, Linux, kitsubito)	Test — Phase A (light pool; full parallel on Linux, bounded on Windows)	2026-07-29T08:48:57.9748645Z         PASS [   0.004s] (2029/2072) spt-term screen::tests::repaint_emits_display_width_not_scalar_count_per_row
test (self-hosted, Linux, kitsubito)	Test — Phase A (light pool; full parallel on Linux, bounded on Windows)	2026-07-29T08:48:57.9752617Z         PASS [   0.004s] (2030/2072) spt-term screen::tests::repaint_then_raw_scroll_matches_the_server_grid
test (self-hosted, Linux, kitsubito)	Test — Phase A (light pool; full parallel on Linux, bounded on Windows)	2026-07-29T08:48:57.9753862Z         PASS [   0.004s] (2031/2072) spt-term screen::tests::repaint_replays_tracked_decstbm_before_cursor_placement
test (self-hosted, Linux, kitsubito)	Test — Phase A (light pool; full parallel on Linux, bounded on Windows)	2026-07-29T08:48:57.9795009Z         PASS [   0.004s] (2032/2072) spt-term screen::tests::resize_through_a_wide_pair_heals_the_cut_lead
test (self-hosted, Linux, kitsubito)	Test — Phase A (light pool; full parallel on Linux, bounded on Windows)	2026-07-29T08:48:57.9796045Z         PASS [   0.005s] (2033/2072) spt-term screen::tests::resize_preserves_content
test (self-hosted, Linux, kitsubito)	Test — Phase A (light pool; full parallel on Linux, bounded on Windows)	2026-07-29T08:48:57.9796743Z         PASS [   0.004s] (2034/2072) spt-term screen::tests::resize_preserves_title
test (self-hosted, Linux, kitsubito)	Test — Phase A (light pool; full parallel on Linux, bounded on Windows)	2026-07-29T08:48:57.9838754Z         PASS [   0.004s] (2035/2072) spt-term screen::tests::ris_mid_capture_keeps_the_deferred_tail
test (self-hosted, Linux, kitsubito)	Test — Phase A (light pool; full parallel on Linux, bounded on Windows)	2026-07-29T08:48:57.9841545Z         PASS [   0.004s] (2036/2072) spt-term screen::tests::sgr_pen_reconstructed_in_repaint
test (self-hosted, Linux, kitsubito)	Test — Phase A (light pool; full parallel on Linux, bounded on Windows)	2026-07-29T08:48:57.9846633Z         PASS [   0.005s] (2037/2072) spt-term screen::tests::ris_clears_title_and_untitled_emits_none
test (self-hosted, Linux, kitsubito)	Test — Phase A (light pool; full parallel on Linux, bounded on Windows)	2026-07-29T08:48:57.9878899Z         PASS [   0.294s] (2038/2072) spt-store worker_reap::tests::reap_preserves_wseq_so_next_mint_continues
test (self-hosted, Linux, kitsubito)	Test — Phase A (light pool; full parallel on Linux, bounded on Windows)	2026-07-29T08:48:57.9885321Z         PASS [   0.004s] (2039/2072) spt-term screen::tests::wide_glyph_advances_two_display_columns
test (self-hosted, Linux, kitsubito)	Test — Phase A (light pool; full parallel on Linux, bounded on Windows)	2026-07-29T08:48:57.9886083Z         PASS [   0.004s] (2040/2072) spt-term screen::tests::wide_glyph_wraps_whole_at_right_margin
test (self-hosted, Linux, kitsubito)	Test — Phase A (light pool; full parallel on Linux, bounded on Windows)	2026-07-29T08:48:57.9888047Z         PASS [   0.005s] (2041/2072) spt-term screen::tests::title_captured_and_replayed_in_repaint
test (self-hosted, Linux, kitsubito)	Test — Phase A (light pool; full parallel on Linux, bounded on Windows)	2026-07-29T08:48:57.9922167Z         PASS [   0.004s] (2042/2072) spt-term winprog::tests::bare_name_prefers_cmd_over_extensionless_shim
test (self-hosted, Linux, kitsubito)	Test — Phase A (light pool; full parallel on Linux, bounded on Windows)	2026-07-29T08:48:57.9926187Z         PASS [   0.004s] (2043/2072) spt-term winprog::tests::bare_name_prefers_exe_and_spawns_direct
test (self-hosted, Linux, kitsubito)	Test — Phase A (light pool; full parallel on Linux, bounded on Windows)	2026-07-29T08:48:57.9928915Z         PASS [   0.004s] (2044/2072) spt-term winprog::tests::earlier_path_dir_wins
test (self-hosted, Linux, kitsubito)	Test — Phase A (light pool; full parallel on Linux, bounded on Windows)	2026-07-29T08:48:57.9931496Z         PASS [   0.004s] (2045/2072) spt-term winprog::tests::explicit_extension_is_classified_in_place
test (self-hosted, Linux, kitsubito)	Test — Phase A (light pool; full parallel on Linux, bounded on Windows)	2026-07-29T08:48:57.9962718Z         PASS [   0.004s] (2046/2072) spt-term winprog::tests::unresolvable_passes_through
test (self-hosted, Linux, kitsubito)	Test — Phase A (light pool; full parallel on Linux, bounded on Windows)	2026-07-29T08:48:57.9967892Z         PASS [   0.004s] (2047/2072) xtask::bin/xtask asset_map_tests::asset_target_triple_resolves_musl_from_registry
test (self-hosted, Linux, kitsubito)	Test — Phase A (light pool; full parallel on Linux, bounded on Windows)	2026-07-29T08:48:57.9970931Z         PASS [   0.004s] (2048/2072) spt-test-support tests::scoped_home_cleans_without_overriding_the_outer_temp_sandbox
test (self-hosted, Linux, kitsubito)	Test — Phase A (light pool; full parallel on Linux, bounded on Windows)	2026-07-29T08:48:57.9978043Z         PASS [   0.004s] (2049/2072) xtask::bin/xtask converge_tests::converge_table_renders_rows_and_success_predicate
test (self-hosted, Linux, kitsubito)	Test — Phase A (light pool; full parallel on Linux, bounded on Windows)	2026-07-29T08:48:58.0004766Z         PASS [   0.004s] (2050/2072) xtask::bin/xtask docs_token_gate_tests::clean_help_text_passes
test (self-hosted, Linux, kitsubito)	Test — Phase A (light pool; full parallel on Linux, bounded on Windows)	2026-07-29T08:48:58.0008388Z         PASS [   0.004s] (2051/2072) xtask::bin/xtask docs_token_gate_tests::planted_internal_codes_are_flagged
test (self-hosted, Linux, kitsubito)	Test — Phase A (light pool; full parallel on Linux, bounded on Windows)	2026-07-29T08:48:58.0009414Z         PASS [   0.004s] (2052/2072) xtask::bin/xtask heavy_class_tests::a_by_binary_filter_does_not_classify_a_lib_module
test (self-hosted, Linux, kitsubito)	Test — Phase A (light pool; full parallel on Linux, bounded on Windows)	2026-07-29T08:48:58.0022817Z         PASS [   0.004s] (2053/2072) xtask::bin/xtask heavy_class_tests::a_module_inside_an_alternation_group_reads_as_classified
test (self-hosted, Linux, kitsubito)	Test — Phase A (light pool; full parallel on Linux, bounded on Windows)	2026-07-29T08:48:58.0053383Z         PASS [   0.005s] (2054/2072) xtask::bin/xtask heavy_class_tests::only_a_broker_bound_inside_the_test_block_counts
test (self-hosted, Linux, kitsubito)	Test — Phase A (light pool; full parallel on Linux, bounded on Windows)	2026-07-29T08:48:58.0054565Z         PASS [   0.004s] (2055/2072) xtask::bin/xtask phase_a_profile_tests::a_mirrored_override_that_drifted_reads_as_missing
test (self-hosted, Linux, kitsubito)	Test — Phase A (light pool; full parallel on Linux, bounded on Windows)	2026-07-29T08:48:58.0055540Z         PASS [   0.004s] (2056/2072) xtask::bin/xtask phase_a_profile_tests::a_heavy_by_binary_override_needs_no_mirror
test (self-hosted, Linux, kitsubito)	Test — Phase A (light pool; full parallel on Linux, bounded on Windows)	2026-07-29T08:48:58.0056451Z         PASS [   0.004s] (2057/2072) xtask::bin/xtask phase_a_profile_tests::a_mirrored_phase_a_override_is_satisfied
test (self-hosted, Linux, kitsubito)	Test — Phase A (light pool; full parallel on Linux, bounded on Windows)	2026-07-29T08:48:58.0092008Z         PASS [   0.004s] (2058/2072) xtask::bin/xtask spt_bin_tests::target_debug_dir_honors_cargo_target_dir
test (self-hosted, Linux, kitsubito)	Test — Phase A (light pool; full parallel on Linux, bounded on Windows)	2026-07-29T08:48:58.0093371Z         PASS [   0.004s] (2059/2072) xtask::bin/xtask phase_a_profile_tests::an_unmirrored_phase_a_override_is_reported
test (self-hosted, Linux, kitsubito)	Test — Phase A (light pool; full parallel on Linux, bounded on Windows)	2026-07-29T08:48:58.0094955Z         PASS [   0.004s] (2060/2072) xtask::bin/xtask phase_a_profile_tests::the_checked_in_config_is_in_parity
test (self-hosted, Linux, kitsubito)	Test — Phase A (light pool; full parallel on Linux, bounded on Windows)	2026-07-29T08:48:58.0954727Z         PASS [   0.406s] (2061/2072) spt-store worker_reap::tests::keeps_inflight_and_pending_reaps_drained
test (self-hosted, Linux, kitsubito)	Test — Phase A (light pool; full parallel on Linux, bounded on Windows)	2026-07-29T08:48:58.1135330Z         PASS [   0.400s] (2062/2072) spt-store worker_reap::tests::ttl_overrides_live_ready_marker
test (self-hosted, Linux, kitsubito)	Test — Phase A (light pool; full parallel on Linux, bounded on Windows)	2026-07-29T08:48:58.1391345Z         PASS [   0.515s] (2063/2072) spt-store syncmerge::tests::legacy_bottom_vectors_surface_not_overwrite
test (self-hosted, Linux, kitsubito)	Test — Phase A (light pool; full parallel on Linux, bounded on Windows)	2026-07-29T08:48:58.2068871Z         PASS [   0.588s] (2064/2072) spt-store syncmerge::tests::adopt_then_incremental_then_idempotent_repull
test (self-hosted, Linux, kitsubito)	Test — Phase A (light pool; full parallel on Linux, bounded on Windows)	2026-07-29T08:48:58.3252725Z         PASS [   0.671s] (2065/2072) spt-store syncmerge::tests::project_branch_unions_disjoint_agents
test (self-hosted, Linux, kitsubito)	Test — Phase A (light pool; full parallel on Linux, bounded on Windows)	2026-07-29T08:48:58.5104780Z         PASS [   0.887s] (2066/2072) spt-store syncmerge::tests::dominated_incoming_drops_but_joins_dag
test (self-hosted, Linux, kitsubito)	Test — Phase A (light pool; full parallel on Linux, bounded on Windows)	2026-07-29T08:48:58.5297220Z         PASS [   0.909s] (2067/2072) spt-store syncmerge::tests::concurrent_writes_surface_on_both_nodes
test (self-hosted, Linux, kitsubito)	Test — Phase A (light pool; full parallel on Linux, bounded on Windows)	2026-07-29T08:48:58.8100774Z         PASS [   1.147s] (2068/2072) spt-store syncmerge::tests::reconciled_write_propagates_and_clears_artifacts
test (self-hosted, Linux, kitsubito)	Test — Phase A (light pool; full parallel on Linux, bounded on Windows)	2026-07-29T08:48:59.6794532Z         PASS [   1.871s] (2069/2072) spt-store::carrier_claim_int two_carriers_race_one_spool_every_row_delivered_exactly_once
test (self-hosted, Linux, kitsubito)	Test — Phase A (light pool; full parallel on Linux, bounded on Windows)	2026-07-29T08:49:01.5319678Z         PASS [   4.869s] (2070/2072) spt-store info::tests::write_info_racing_mutate_info_never_lost_update
test (self-hosted, Linux, kitsubito)	Test — Phase A (light pool; full parallel on Linux, bounded on Windows)	2026-07-29T08:49:02.6805315Z         PASS [  10.657s] (2071/2072) spt-daemon::pump pump_w2_live_peer_advertised_amid_dead_peers_no_restart
test (self-hosted, Linux, kitsubito)	Test — Phase A (light pool; full parallel on Linux, bounded on Windows)	2026-07-29T08:49:04.5669287Z         PASS [  47.322s] (2072/2072) spt::endpoint_autostart_e2e saved_endpoint_replays_on_daemon_restart
test (self-hosted, Linux, kitsubito)	Test — Phase A (light pool; full parallel on Linux, bounded on Windows)	2026-07-29T08:49:04.5670270Z ────────────
test (self-hosted, Linux, kitsubito)	Test — Phase A (light pool; full parallel on Linux, bounded on Windows)	2026-07-29T08:49:04.5670752Z      Summary [  47.705s] 2072 tests run: 2071 passed (2 leaky), 1 failed, 1 skipped
test (self-hosted, Linux, kitsubito)	Test — Phase A (light pool; full parallel on Linux, bounded on Windows)	2026-07-29T08:49:04.5671668Z         FAIL [  30.108s] (1102/2072) spt::activity_link_push_e2e activity_frames_reach_a_linked_shell_through_the_real_daemon
test (self-hosted, Linux, kitsubito)	Test — Phase A (light pool; full parallel on Linux, bounded on Windows)	2026-07-29T08:49:04.5937034Z error: test run failed
test (self-hosted, Linux, kitsubito)	Test — Phase A (light pool; full parallel on Linux, bounded on Windows)	2026-07-29T08:49:04.6128588Z ##[error]Process completed with exit code 100.


Wall time: 1.31 seconds